Reaction Details
TargetNuclear receptor coactivator 1
LigandBDBM87260
Substrate/Competitorn/a
Meas. Tech.Counterscreen for inhibitors of the Steroid Receptor Coactivator 3 (SRC3; NCOA3)
IC50 10470±n/a nM
Citation PubChem, PC Counterscreen for inhibitors of the Steroid Receptor Coactivator 3 (SRC3; NCOA3): Luminescence-based cell-based high throughput dose response assay to identify inhibitors of the Steroid Receptor Coactivator 1 (SRC1; NCOA1) PubChem Bioassay(2012)[AID]
 
Nuclear receptor coactivator 1
Name:Nuclear receptor coactivator 1
Type:PROTEIN
Mol. Mass.:156749.34
Organism:Homo sapiens (Human)
Description:ChEMBL_759690
Residue:1441
BDBM87260
NameBDBM87260
Synonyms:5-(4-chlorophenyl)-N-(2-morpholin-4-ylethyl)thieno[2,3-d]pyrimidin-4-amine MLS000528887 [5-(4-Chloro-phenyl)-thieno[2,3-d]pyrimidin-4-yl]-(2-morpholin-4-yl-ethyl)-amine cid_1078331
TypeSmall organic molecule
Emp. Form.C18H19ClN4OS
Mol. Mass.374.888
SMILESClc1ccc(cc1)-c1csc2ncnc(NCCN3CCOCC3)c12