Reaction Details
TargetNuclear receptor coactivator 1
LigandBDBM62958
Substrate/Competitorn/a
Meas. Tech.Counterscreen for inhibitors of the Steroid Receptor Coactivator 3 (SRC3; NCOA3)
IC50 8169±n/a nM
Citation PubChem, PC Counterscreen for inhibitors of the Steroid Receptor Coactivator 3 (SRC3; NCOA3): Luminescence-based cell-based high throughput dose response assay to identify inhibitors of the Steroid Receptor Coactivator 1 (SRC1; NCOA1) PubChem Bioassay(2012)[AID]
 
Nuclear receptor coactivator 1
Name:Nuclear receptor coactivator 1
Type:PROTEIN
Mol. Mass.:156749.34
Organism:Homo sapiens (Human)
Description:ChEMBL_759690
Residue:1441
BDBM62958
NameBDBM62958
Synonyms:MLS000531259 N-[[(E)-(3-methoxy-4-oxidanylidene-cyclohexa-2,5-dien-1-ylidene)methyl]amino]-N'-(4-methylphenyl)-1,3-benzothiazole-2-carboximidamide N-[[(E)-(3-methoxy-4-oxocyclohexa-2,5-dien-1-ylidene)methyl]amino]-N'-(4-methylphenyl)-1,3-benzothiazole-2-carboximidamide SMR000136237 | cid_5735441
TypeSmall organic molecule
Emp. Form.C23H20N4O2S
Mol. Mass.416.496
SMILESCOc1cc(C=NN=C(Nc2ccc(C)cc2)c2nc3ccccc3s2)ccc1O