Reaction Details
TargetNuclear receptor coactivator 1
LigandBDBM87261
Substrate/Competitorn/a
Meas. Tech.Counterscreen for inhibitors of the Steroid Receptor Coactivator 3 (SRC3; NCOA3)
IC50 11291±n/a nM
Citation PubChem, PC Counterscreen for inhibitors of the Steroid Receptor Coactivator 3 (SRC3; NCOA3): Luminescence-based cell-based high throughput dose response assay to identify inhibitors of the Steroid Receptor Coactivator 1 (SRC1; NCOA1) PubChem Bioassay(2012)[AID]
 
Nuclear receptor coactivator 1
Name:Nuclear receptor coactivator 1
Type:PROTEIN
Mol. Mass.:156749.34
Organism:Homo sapiens (Human)
Description:ChEMBL_759690
Residue:1441
BDBM87261
NameBDBM87261
Synonyms:MLS000554094 N'-(4-cyano-5-ethyl-3-pyrido[4,3-b]indolyl)-N,N-dimethylmethanimidamide N'-(4-cyano-5-ethyl-pyrido[4,3-b]indol-3-yl)-N,N-dimethyl-methanimidamide SMR000146411 | cid_3707292
TypeSmall organic molecule
Emp. Form.C17H17N5
Mol. Mass.291.3504
SMILESCCn1c2ccccc2c2cnc(\N=C\N(C)C)c(C#N)c12