Reaction Details
TargetNuclear receptor coactivator 1
LigandBDBM87267
Substrate/Competitorn/a
Meas. Tech.Counterscreen for inhibitors of the Steroid Receptor Coactivator 3 (SRC3; NCOA3)
IC50 9271±n/a nM
Citation PubChem, PC Counterscreen for inhibitors of the Steroid Receptor Coactivator 3 (SRC3; NCOA3): Luminescence-based cell-based high throughput dose response assay to identify inhibitors of the Steroid Receptor Coactivator 1 (SRC1; NCOA1) PubChem Bioassay(2012)[AID]
 
Nuclear receptor coactivator 1
Name:Nuclear receptor coactivator 1
Type:PROTEIN
Mol. Mass.:156749.34
Organism:Homo sapiens (Human)
Description:ChEMBL_759690
Residue:1441
BDBM87267
NameBDBM87267
Synonyms:4-[2-(4-Chloro-phenoxy)-acetylamino]-N-pyridin-3-ylmethyl-benzamide 4-[[2-(4-chlorophenoxy)-1-oxoethyl]amino]-N-(3-pyridinylmethyl)benzamide 4-[[2-(4-chlorophenoxy)acetyl]amino]-N-(pyridin-3-ylmethyl)benzamide SMR000172649 | cid_1150809
TypeSmall organic molecule
Emp. Form.C21H18ClN3O3
Mol. Mass.395.839
SMILESClc1ccc(OCC(=O)Nc2ccc(cc2)C(=O)NCc2cccnc2)cc1