Reaction Details
TargetNuclear receptor coactivator 1
LigandBDBM67919
Substrate/Competitorn/a
Meas. Tech.Counterscreen for inhibitors of the Steroid Receptor Coactivator 3 (SRC3; NCOA3)
IC50 10324±n/a nM
Citation PubChem, PC Counterscreen for inhibitors of the Steroid Receptor Coactivator 3 (SRC3; NCOA3): Luminescence-based cell-based high throughput dose response assay to identify inhibitors of the Steroid Receptor Coactivator 1 (SRC1; NCOA1) PubChem Bioassay(2012)[AID]
 
Nuclear receptor coactivator 1
Name:Nuclear receptor coactivator 1
Type:PROTEIN
Mol. Mass.:156749.34
Organism:Homo sapiens (Human)
Description:ChEMBL_759690
Residue:1441
BDBM67919
NameBDBM67919
Synonyms:1-[4-(2,4-Dichloro-benzyloxy)-phenyl]-3-phenyl-thiourea 1-[4-[(2,4-dichlorophenyl)methoxy]phenyl]-3-phenyl-thiourea MLS000555361 cid_1143231
TypeSmall organic molecule
Emp. Form.C20H16Cl2N2OS
Mol. Mass.403.325
SMILESClc1ccc(COc2ccc(NC(=S)Nc3ccccc3)cc2)c(Cl)c1