Reaction Details
TargetNuclear receptor coactivator 1
LigandBDBM87272
Substrate/Competitorn/a
Meas. Tech.Counterscreen for inhibitors of the Steroid Receptor Coactivator 3 (SRC3; NCOA3)
IC50 10545±n/a nM
Citation PubChem, PC Counterscreen for inhibitors of the Steroid Receptor Coactivator 3 (SRC3; NCOA3): Luminescence-based cell-based high throughput dose response assay to identify inhibitors of the Steroid Receptor Coactivator 1 (SRC1; NCOA1) PubChem Bioassay(2012)[AID]
 
Nuclear receptor coactivator 1
Name:Nuclear receptor coactivator 1
Type:PROTEIN
Mol. Mass.:156749.34
Organism:Homo sapiens (Human)
Description:ChEMBL_759690
Residue:1441
BDBM87272
NameBDBM87272
Synonyms:2-(N-mesyl-2-methyl-5-nitro-anilino)-N-[4-[(2-methoxy-5-methyl-phenyl)sulfamoyl]phenyl]acetamide N-[4-[(2-methoxy-5-methyl-phenyl)sulfamoyl]phenyl]-2-[(2-methyl-5-nitro-phenyl)-methylsulfonyl-amino]ethanamide N~1~-(4-{[(2-methoxy-5-methylphenyl)amino]sulfonyl}phenyl)-N~2~-(2-methyl-5-nitrophenyl)-N~2~-(methylsulfonyl)glycinamide cid_2199765
TypeSmall organic molecule
Emp. Form.C24H26N4O8S2
Mol. Mass.562.615
SMILESCOc1ccc(C)cc1NS(=O)(=O)c1ccc(NC(=O)CN(c2cc(ccc2C)[N+]([O-])=O)S(C)(=O)=O)cc1