Reaction Details
TargetNuclear receptor coactivator 1
LigandBDBM77529
Substrate/Competitorn/a
Meas. Tech.Counterscreen for inhibitors of the Steroid Receptor Coactivator 3 (SRC3; NCOA3)
IC50 7242±n/a nM
Citation PubChem, PC Counterscreen for inhibitors of the Steroid Receptor Coactivator 3 (SRC3; NCOA3): Luminescence-based cell-based high throughput dose response assay to identify inhibitors of the Steroid Receptor Coactivator 1 (SRC1; NCOA1) PubChem Bioassay(2012)[AID]
 
Nuclear receptor coactivator 1
Name:Nuclear receptor coactivator 1
Type:PROTEIN
Mol. Mass.:156749.34
Organism:Homo sapiens (Human)
Description:ChEMBL_759690
Residue:1441
BDBM77529
NameBDBM77529
Synonyms:MLS000548411 N-[1,3-benzodioxol-5-yl-(5-chloro-8-hydroxy-7-quinolinyl)methyl]butanamide N-[1,3-benzodioxol-5-yl-(5-chloro-8-hydroxyquinolin-7-yl)methyl]butanamide SMR000172091 | cid_3138755
TypeSmall organic molecule
Emp. Form.C21H19ClN2O4
Mol. Mass.398.84
SMILESCCCC(=O)NC(c1ccc2OCOc2c1)c1cc(Cl)c2cccnc2c1O