Reaction Details
TargetNuclear receptor coactivator 1
LigandBDBM87280
Substrate/Competitorn/a
Meas. Tech.Counterscreen for inhibitors of the Steroid Receptor Coactivator 3 (SRC3; NCOA3)
IC50 9451±n/a nM
Citation PubChem, PC Counterscreen for inhibitors of the Steroid Receptor Coactivator 3 (SRC3; NCOA3): Luminescence-based cell-based high throughput dose response assay to identify inhibitors of the Steroid Receptor Coactivator 1 (SRC1; NCOA1) PubChem Bioassay(2012)[AID]
 
Nuclear receptor coactivator 1
Name:Nuclear receptor coactivator 1
Type:PROTEIN
Mol. Mass.:156749.34
Organism:Homo sapiens (Human)
Description:ChEMBL_759690
Residue:1441
BDBM87280
NameBDBM87280
Synonyms:3-(2-Methyl-3-propyl-quinolin-4-ylsulfanyl)-propionitrile 3-(2-methyl-3-propylquinolin-4-yl)sulfanylpropanenitrile 3-[(2-methyl-3-propyl-4-quinolyl)thio]propionitrile SMR000218763 | cid_1948928
TypeSmall organic molecule
Emp. Form.C16H18N2S
Mol. Mass.270.393
SMILESCCCc1c(C)nc2ccccc2c1SCCC#N