Reaction Details
TargetNuclear receptor coactivator 1
LigandBDBM68079
Substrate/Competitorn/a
Meas. Tech.Counterscreen for inhibitors of the Steroid Receptor Coactivator 3 (SRC3; NCOA3)
IC50 11195±n/a nM
Citation PubChem, PC Counterscreen for inhibitors of the Steroid Receptor Coactivator 3 (SRC3; NCOA3): Luminescence-based cell-based high throughput dose response assay to identify inhibitors of the Steroid Receptor Coactivator 1 (SRC1; NCOA1) PubChem Bioassay(2012)[AID]
 
Nuclear receptor coactivator 1
Name:Nuclear receptor coactivator 1
Type:PROTEIN
Mol. Mass.:156749.34
Organism:Homo sapiens (Human)
Description:ChEMBL_759690
Residue:1441
BDBM68079
NameBDBM68079
Synonyms:3,5,6-trichloro-1-(4-methylphenyl)-2(1H)-pyrazinone 3,5,6-trichloro-1-(4-methylphenyl)pyrazin-2-one 3,5,6-tris(chloranyl)-1-(4-methylphenyl)pyrazin-2-one SMR000229702 | cid_849396
TypeSmall organic molecule
Emp. Form.C11H7Cl3N2O
Mol. Mass.289.545
SMILESCc1ccc(cc1)-n1c(Cl)c(Cl)nc(Cl)c1=O