Reaction Details
TargetNuclear receptor coactivator 1
LigandBDBM87295
Substrate/Competitorn/a
Meas. Tech.Counterscreen for inhibitors of the Steroid Receptor Coactivator 3 (SRC3; NCOA3)
IC50 9167±n/a nM
Citation PubChem, PC Counterscreen for inhibitors of the Steroid Receptor Coactivator 3 (SRC3; NCOA3): Luminescence-based cell-based high throughput dose response assay to identify inhibitors of the Steroid Receptor Coactivator 1 (SRC1; NCOA1) PubChem Bioassay(2012)[AID]
 
Nuclear receptor coactivator 1
Name:Nuclear receptor coactivator 1
Type:PROTEIN
Mol. Mass.:156749.34
Organism:Homo sapiens (Human)
Description:ChEMBL_759690
Residue:1441
BDBM87295
NameBDBM87295
Synonyms:(4-methoxyphenyl)-(3-nitro-4-pyridyl)amine N-(4-methoxyphenyl)-3-nitro-4-pyridinamine N-(4-methoxyphenyl)-3-nitropyridin-4-amine cid_2944858
TypeSmall organic molecule
Emp. Form.C12H11N3O3
Mol. Mass.245.234
SMILESCOc1ccc(Nc2ccncc2[N+]([O-])=O)cc1