Reaction Details
TargetNuclear receptor coactivator 1
LigandBDBM87300
Substrate/Competitorn/a
Meas. Tech.Counterscreen for inhibitors of the Steroid Receptor Coactivator 3 (SRC3; NCOA3)
IC50 9901±n/a nM
Citation PubChem, PC Counterscreen for inhibitors of the Steroid Receptor Coactivator 3 (SRC3; NCOA3): Luminescence-based cell-based high throughput dose response assay to identify inhibitors of the Steroid Receptor Coactivator 1 (SRC1; NCOA1) PubChem Bioassay(2012)[AID]
 
Nuclear receptor coactivator 1
Name:Nuclear receptor coactivator 1
Type:PROTEIN
Mol. Mass.:156749.34
Organism:Homo sapiens (Human)
Description:ChEMBL_759690
Residue:1441
BDBM87300
NameBDBM87300
Synonyms:(1-ethylimidazol-2-yl)methyl-[[5-(3-fluoro-4-methoxy-phenyl)-1H-pyrazol-4-yl]methyl]-methyl-amine MLS000734898 N-[(1-ethylimidazol-2-yl)methyl]-1-[5-(3-fluoranyl-4-methoxy-phenyl)-1H-pyrazol-4-yl]-N-methyl-methanamine SMR000315814 | cid_16191488
TypeSmall organic molecule
Emp. Form.C18H22FN5O
Mol. Mass.343.3986
SMILESCCn1ccnc1CN(C)Cc1c[nH]nc1-c1ccc(OC)c(F)c1