Reaction Details
TargetNuclear receptor coactivator 1
LigandBDBM63590
Substrate/Competitorn/a
Meas. Tech.Counterscreen for inhibitors of the Steroid Receptor Coactivator 3 (SRC3; NCOA3)
IC50 10540±n/a nM
Citation PubChem, PC Counterscreen for inhibitors of the Steroid Receptor Coactivator 3 (SRC3; NCOA3): Luminescence-based cell-based high throughput dose response assay to identify inhibitors of the Steroid Receptor Coactivator 1 (SRC1; NCOA1) PubChem Bioassay(2012)[AID]
 
Nuclear receptor coactivator 1
Name:Nuclear receptor coactivator 1
Type:PROTEIN
Mol. Mass.:156749.34
Organism:Homo sapiens (Human)
Description:ChEMBL_759690
Residue:1441
BDBM63590
NameBDBM63590
Synonyms:MLS000419595 N-(6,7-dihydro-[1,4]dioxino[2,3-f][1,3]benzothiazol-2-yl)-2,3-dihydro-1,4-dioxine-5-carboxamide SMR000320312 | cid_7203047
TypeSmall organic molecule
Emp. Form.C14H12N2O5S
Mol. Mass.320.32
SMILESO=C(Nc1nc2cc3OCCOc3cc2s1)C1=COCCO1