Reaction Details
TargetNuclear receptor coactivator 1
LigandBDBM87313
Substrate/Competitorn/a
Meas. Tech.Counterscreen for inhibitors of the Steroid Receptor Coactivator 3 (SRC3; NCOA3)
IC50 8325±n/a nM
Citation PubChem, PC Counterscreen for inhibitors of the Steroid Receptor Coactivator 3 (SRC3; NCOA3): Luminescence-based cell-based high throughput dose response assay to identify inhibitors of the Steroid Receptor Coactivator 1 (SRC1; NCOA1) PubChem Bioassay(2012)[AID]
 
Nuclear receptor coactivator 1
Name:Nuclear receptor coactivator 1
Type:PROTEIN
Mol. Mass.:156749.34
Organism:Homo sapiens (Human)
Description:ChEMBL_759690
Residue:1441
BDBM87313
NameBDBM87313
Synonyms:1-(2-methyl-5-thiophen-2-yl-4-thieno[2,3-d]pyrimidinyl)-4-piperidinecarboxamide 1-(2-methyl-5-thiophen-2-ylthieno[2,3-d]pyrimidin-4-yl)piperidine-4-carboxamide MLS001033523 cid_2464730
TypeSmall organic molecule
Emp. Form.C17H18N4OS2
Mol. Mass.358.481
SMILESCc1nc(N2CCC(CC2)C(N)=O)c2c(csc2n1)-c1cccs1