Reaction Details
TargetNuclear receptor coactivator 1
LigandBDBM87316
Substrate/Competitorn/a
Meas. Tech.Counterscreen for inhibitors of the Steroid Receptor Coactivator 3 (SRC3; NCOA3)
IC50 10581±n/a nM
Citation PubChem, PC Counterscreen for inhibitors of the Steroid Receptor Coactivator 3 (SRC3; NCOA3): Luminescence-based cell-based high throughput dose response assay to identify inhibitors of the Steroid Receptor Coactivator 1 (SRC1; NCOA1) PubChem Bioassay(2012)[AID]
 
Nuclear receptor coactivator 1
Name:Nuclear receptor coactivator 1
Type:PROTEIN
Mol. Mass.:156749.34
Organism:Homo sapiens (Human)
Description:ChEMBL_759690
Residue:1441
BDBM87316
NameBDBM87316
Synonyms:4-(1-azepanyl)-N-[3-(1-imidazolyl)propyl]-3-nitrobenzamide;hydrochloride 4-(azepan-1-yl)-N-(3-imidazol-1-ylpropyl)-3-nitrobenzamide;hydrochloride SMR000353663 | cid_16196934
TypeSmall organic molecule
Emp. Form.C19H25N5O3
Mol. Mass.371.4335
SMILES[O-][N+](=O)c1cc(ccc1N1CCCCCC1)C(=O)NCCCn1ccnc1