Reaction Details
TargetNuclear receptor coactivator 1
LigandBDBM81108
Substrate/Competitorn/a
Meas. Tech.Counterscreen for inhibitors of the Steroid Receptor Coactivator 3 (SRC3; NCOA3)
IC50 3672±n/a nM
Citation PubChem, PC Counterscreen for inhibitors of the Steroid Receptor Coactivator 3 (SRC3; NCOA3): Luminescence-based cell-based high throughput dose response assay to identify inhibitors of the Steroid Receptor Coactivator 1 (SRC1; NCOA1) PubChem Bioassay(2012)[AID]
 
Nuclear receptor coactivator 1
Name:Nuclear receptor coactivator 1
Type:PROTEIN
Mol. Mass.:156749.34
Organism:Homo sapiens (Human)
Description:ChEMBL_759690
Residue:1441
BDBM81108
NameBDBM81108
Synonyms:Biphenyl-4-yl-[4-(2-hydroxy-ethyl)-piperazin-1-yl]-methanethione SMR000438326 [4-(2-hydroxyethyl)piperazin-1-yl]-(4-phenylphenyl)methanethione cid_848267
TypeSmall organic molecule
Emp. Form.C19H22N2OS
Mol. Mass.326.456
SMILESOCCN1CCN(CC1)C(=S)c1ccc(cc1)-c1ccccc1