Reaction Details
TargetNuclear receptor coactivator 1
LigandBDBM87323
Substrate/Competitorn/a
Meas. Tech.Counterscreen for inhibitors of the Steroid Receptor Coactivator 3 (SRC3; NCOA3)
IC50 3779±n/a nM
Citation PubChem, PC Counterscreen for inhibitors of the Steroid Receptor Coactivator 3 (SRC3; NCOA3): Luminescence-based cell-based high throughput dose response assay to identify inhibitors of the Steroid Receptor Coactivator 1 (SRC1; NCOA1) PubChem Bioassay(2012)[AID]
 
Nuclear receptor coactivator 1
Name:Nuclear receptor coactivator 1
Type:PROTEIN
Mol. Mass.:156749.34
Organism:Homo sapiens (Human)
Description:ChEMBL_759690
Residue:1441
BDBM87323
NameBDBM87323
Synonyms:9-Glycineamido-20(S)-camptothecin.HCl SMR000529074 | cid_3246719
TypeSmall organic molecule
Emp. Form.C22H21ClN4O5
Mol. Mass.456.879
SMILESCl.CC[C@@]1(O)C(=O)OCc2c1cc1-c3nc4cccc(NC(=O)CN)c4cc3Cn1c2=O