Reaction Details
TargetNuclear receptor coactivator 1
LigandBDBM58327
Substrate/Competitorn/a
Meas. Tech.Counterscreen for inhibitors of the Steroid Receptor Coactivator 3 (SRC3; NCOA3)
IC50 8712±n/a nM
Citation PubChem, PC Counterscreen for inhibitors of the Steroid Receptor Coactivator 3 (SRC3; NCOA3): Luminescence-based cell-based high throughput dose response assay to identify inhibitors of the Steroid Receptor Coactivator 1 (SRC1; NCOA1) PubChem Bioassay(2012)[AID]
 
Nuclear receptor coactivator 1
Name:Nuclear receptor coactivator 1
Type:PROTEIN
Mol. Mass.:156749.34
Organism:Homo sapiens (Human)
Description:ChEMBL_759690
Residue:1441
BDBM58327
NameBDBM58327
Synonyms:MLS001204085 N-[(4-chlorophenyl)-(8-hydroxy-7-quinolinyl)methyl]butanamide N-[(4-chlorophenyl)-(8-hydroxyquinolin-7-yl)methyl]butanamide SMR000516562 | cid_2876611
TypeSmall organic molecule
Emp. Form.C20H19ClN2O2
Mol. Mass.354.83
SMILESCCCC(=O)NC(c1ccc(Cl)cc1)c1ccc2cccnc2c1O