Reaction Details
TargetNuclear receptor coactivator 1
LigandBDBM64729
Substrate/Competitorn/a
Meas. Tech.Counterscreen for inhibitors of the Steroid Receptor Coactivator 3 (SRC3; NCOA3)
IC50>3985±n/a nM
Citation PubChem, PC Counterscreen for inhibitors of the Steroid Receptor Coactivator 3 (SRC3; NCOA3): Luminescence-based cell-based high throughput dose response assay to identify inhibitors of the Steroid Receptor Coactivator 1 (SRC1; NCOA1) PubChem Bioassay(2012)[AID]
 
Nuclear receptor coactivator 1
Name:Nuclear receptor coactivator 1
Type:PROTEIN
Mol. Mass.:156749.34
Organism:Homo sapiens (Human)
Description:ChEMBL_759690
Residue:1441
BDBM64729
NameBDBM64729
Synonyms:MLS001212967 N-[(2,4-dichlorophenyl)-(8-hydroxy-7-quinolyl)methyl]valeramide N-[(2,4-dichlorophenyl)-(8-oxidanylquinolin-7-yl)methyl]pentanamide SMR000517136 | cid_2922048
TypeSmall organic molecule
Emp. Form.C21H20Cl2N2O2
Mol. Mass.403.302
SMILESCCCCC(=O)NC(c1ccc(Cl)cc1Cl)c1ccc2cccnc2c1O