Reaction Details
TargetNuclear receptor coactivator 1
LigandBDBM87336
Substrate/Competitorn/a
Meas. Tech.Counterscreen for inhibitors of the Steroid Receptor Coactivator 3 (SRC3; NCOA3)
IC50 8833±n/a nM
Citation PubChem, PC Counterscreen for inhibitors of the Steroid Receptor Coactivator 3 (SRC3; NCOA3): Luminescence-based cell-based high throughput dose response assay to identify inhibitors of the Steroid Receptor Coactivator 1 (SRC1; NCOA1) PubChem Bioassay(2012)[AID]
 
Nuclear receptor coactivator 1
Name:Nuclear receptor coactivator 1
Type:PROTEIN
Mol. Mass.:156749.34
Organism:Homo sapiens (Human)
Description:ChEMBL_759690
Residue:1441
BDBM87336
NameBDBM87336
Synonyms:(6E)-3-methoxy-6-[4-(4-methoxyphenyl)-1,2-dihydropyrazol-3-ylidene]-1-cyclohexa-2,4-dienone (6E)-3-methoxy-6-[4-(4-methoxyphenyl)-3-pyrazolin-3-ylidene]cyclohexa-2,4-dien-1-one SMR000543396 | cid_24747689
TypeSmall organic molecule
Emp. Form.C17H16N2O3
Mol. Mass.296.3205
SMILESCOc1ccc(cc1)-c1c[nH]nc1-c1ccc(OC)cc1O