Reaction Details
TargetNuclear receptor coactivator 1
LigandBDBM64363
Substrate/Competitorn/a
Meas. Tech.Counterscreen for inhibitors of the Steroid Receptor Coactivator 3 (SRC3; NCOA3)
IC50 10426±n/a nM
Citation PubChem, PC Counterscreen for inhibitors of the Steroid Receptor Coactivator 3 (SRC3; NCOA3): Luminescence-based cell-based high throughput dose response assay to identify inhibitors of the Steroid Receptor Coactivator 1 (SRC1; NCOA1) PubChem Bioassay(2012)[AID]
 
Nuclear receptor coactivator 1
Name:Nuclear receptor coactivator 1
Type:PROTEIN
Mol. Mass.:156749.34
Organism:Homo sapiens (Human)
Description:ChEMBL_759690
Residue:1441
BDBM64363
NameBDBM64363
Synonyms:4-[3-(2-chlorophenyl)-1,2,4-oxadiazol-5-yl]-N-cyclopentyl-butanamide 4-[3-(2-chlorophenyl)-1,2,4-oxadiazol-5-yl]-N-cyclopentylbutanamide SMR000625664 | cid_23605826
TypeSmall organic molecule
Emp. Form.C17H20ClN3O2
Mol. Mass.333.813
SMILESClc1ccccc1-c1noc(CCCC(=O)NC2CCCC2)n1