Reaction Details
TargetNuclear receptor coactivator 1
LigandBDBM87346
Substrate/Competitorn/a
Meas. Tech.Counterscreen for inhibitors of the Steroid Receptor Coactivator 3 (SRC3; NCOA3)
IC50 10249±n/a nM
Citation PubChem, PC Counterscreen for inhibitors of the Steroid Receptor Coactivator 3 (SRC3; NCOA3): Luminescence-based cell-based high throughput dose response assay to identify inhibitors of the Steroid Receptor Coactivator 1 (SRC1; NCOA1) PubChem Bioassay(2012)[AID]
 
Nuclear receptor coactivator 1
Name:Nuclear receptor coactivator 1
Type:PROTEIN
Mol. Mass.:156749.34
Organism:Homo sapiens (Human)
Description:ChEMBL_759690
Residue:1441
BDBM87346
NameBDBM87346
Synonyms:MLS001129740 N-(2-phenylethyl)-2,3-dihydro-1,4-benzodioxine-6-carboxamide SMR000689029 | cid_16547660
TypeSmall organic molecule
Emp. Form.C17H17NO3
Mol. Mass.283.3218
SMILESO=C(NCCc1ccccc1)c1ccc2OCCOc2c1