Reaction Details
TargetAcetylcholinesterase
LigandBDBM91583
Substrate/Competitorn/a
Meas. Tech.Enzyme Inhibition Assay
pH7.4±0
IC50 2.30e+3±n/a nM
Citation Omran, ZStiebing, SGodard, AMSopkova-De Oliveira-Santos, JDallemagne, P Synthesis and biological evaluation of new donepezil-like Thiaindanones as AChE inhibitors. J Enzyme Inhib Med Chem23:696-703 (2008) 
 
Acetylcholinesterase
Name:Acetylcholinesterase
Type:n/a
Mol. Mass.:65900.74
Organism:Tetronarce californica (Pacific electric ray) (Torpedo californica)
Description:P04058
Residue:586
BDBM91583
NameBDBM91583
Synonyms:Thiaindanone, 12
TypeSmall organic molecule
Emp. Form.C20H21Br2F2N3OS
Mol. Mass.549.27
SMILESFC1CC(NC(=O)CN2CCN(Cc3ccccc3F)CC2)c2c(Br)sc(Br)c12