Reaction Details
TargetPolyphenol oxidase 2
LigandBDBM50269559
Substrate/Competitorn/a
Meas. Tech.Tyrosinase Assay
Temperature303.15±0 K
Ki 0.61±0.0 nM
Citation Ryu, YBHa, TJCurtis-Long, MJRyu, HWGal, SWPark, KH Inhibitory effects on mushroom tyrosinase by flavones from the stem barks of Morus lhou (S.) Koidz. J Enzyme Inhib Med Chem23:922-30 (2008) 
 
Polyphenol oxidase 2
Name:Polyphenol oxidase 2
Type:Protein
Mol. Mass.:63923.66
Organism:Agaricus bisporus (Common mushroom)
Description:O42713
Residue:556
BDBM50269559
NameBDBM50269559
Synonyms:2-(2,4-dihydroxyphenyl)-5,7-dihydroxy-4H-chromen-4-one Norartocarpetin, 5 | norartocarpetin
TypeSmall organic molecule
Emp. Form.C15H10O6
Mol. Mass.286.2363
SMILESOc1ccc(c(O)c1)-c1cc(=O)c2c(O)cc(O)cc2o1