Reaction Details
TargetDeoxyuridine 5'-triphosphate nucleotidohydrolase, mitochondrial
LigandBDBM50173567
Substrate/Competitorn/a
Meas. Tech.Inhibition Assay
pH8±0
Temperature298.15±0 K
Ki>1000000±0.0 nM
Citation Musso-Buendía, JAVidal, AEKasinthan, GNguyen, CCarrero-Lérida, JRuiz-Pérez, LMWilson, KJohansson, NGGilbert, IHGonzález-Pacanowska, D Kinetic properties and inhibition of the dimeric dUTPase-dUDPase from Campylobacter jejuni. J Enzyme Inhib Med Chem24:111-6 (2009) 
 
Deoxyuridine 5'-triphosphate nucleotidohydrolase, mitochondrial
Name:Deoxyuridine 5'-triphosphate nucleotidohydrolase, mitochondrial
Type:Enzyme
Mol. Mass.:26574.03
Organism:Homo sapiens (Human)
Description:P33316
Residue:252
BDBM50173567
NameBDBM50173567
Synonyms:1-[5-(tert-Butyl-dimethyl-silanyloxymethyl)-4-fluoro-tetrahydro-furan-2-yl]-1H-pyrimidine-2,4-dione dUTPase inhibitor, 6
TypeSmall organic molecule
Emp. Form.C15H25FN2O4Si
Mol. Mass.344.4539
SMILESCC(C)(C)[Si](C)(C)OCC1OC(CC1F)n1ccc(=O)[nH]c1=O