Reaction Details
TargetPutative glycogen synthase kinase 3 alpha
LigandBDBM50322535
Substrate/Competitorn/a
Meas. Tech.Inhibition Assay
IC50 2.8e+3± 2.0e+3 nM
Citation Grütter, CSimard, JRMayer-Wrangowski, SCSchreier, PHPérez-Martí­n, JRichters, AGetlik, MGutbrod, OBraun, CABeck, MERauh, D Targeting GSK3 from Ustilago maydis: Type-II Kinase Inhibitors as Potential Antifungals. ACS Chem Biol7:1257-67 (2012) 
 
Putative glycogen synthase kinase 3 alpha
Name:Putative glycogen synthase kinase 3 alpha
Synonyms:Glycogen Synthase Kinase 3 (GSK3)
Type:Protein
Mol. Mass.:45420.65
Organism:Ustilago maydis (Smut fungus)
Description:A0A0D1CGS9
Residue:402
BDBM50322535
NameBDBM50322535
TypeSmall organic molecule
Emp. Form.C29H27F3N6O
Mol. Mass.532.5595
SMILESCN1CCN(Cc2ccc(NC(=O)c3ccc(C)c(c3)C#Cc3cnc4cccnn34)cc2C(F)(F)F)CC1