Reaction Details
TargetPutative glycogen synthase kinase 3 alpha
LigandBDBM25115
Substrate/Competitorn/a
Meas. Tech.Inhibition Assay
IC50 54± 14 nM
Citation Grütter, CSimard, JRMayer-Wrangowski, SCSchreier, PHPérez-Martí­n, JRichters, AGetlik, MGutbrod, OBraun, CABeck, MERauh, D Targeting GSK3 from Ustilago maydis: Type-II Kinase Inhibitors as Potential Antifungals. ACS Chem Biol7:1257-67 (2012) 
 
Putative glycogen synthase kinase 3 alpha
Name:Putative glycogen synthase kinase 3 alpha
Synonyms:Glycogen Synthase Kinase 3 (GSK3)
Type:Protein
Mol. Mass.:45420.65
Organism:Ustilago maydis (Smut fungus)
Description:A0A0D1CGS9
Residue:402
BDBM25115
NameBDBM25115
TypeSmall organic molecule
Emp. Form.C20H24BrF2N5O3S
Mol. Mass.532.402
SMILESNC(=O)c1c(NC(=O)NCCCCN2CCCC2)snc1OCc1c(F)cc(Br)cc1F