Reaction Details
TargetAcetylcholine-binding protein
LigandBDBM86311
Substrate/Competitorn/a
Meas. Tech.Radioligand Competition Assay
Ki 8.2±2 nM
Citation Rohde, LAAhring, PKJensen, MLNielsen, EØPeters, DHelgstrand, CKrintel, CHarpsøe, KGajhede, MKastrup, JSBalle, T Intersubunit bridge formation governs agonist efficacy at nicotinic acetylcholine α4β2 receptors: unique role of halogen bonding revealed. J Biol Chem287:4248-59 (2012) 
 
Acetylcholine-binding protein
Name:Acetylcholine-binding protein
Type:n/a
Mol. Mass.:26055.52
Organism:Lymnaea stagnalis
Description:Soluble acetylcholine receptor
Residue:229
BDBM86311
NameBDBM86311
Synonyms:CAS_485-35-8 Cytisine-(-) US11667638, Example Cytisine
TypeSmall organic molecule
Emp. Form.C11H14N2O
Mol. Mass.190.2417
SMILESO=c1cccc2C3CNCC(C3)Cn12