Reaction Details
TargetNeuronal acetylcholine receptor subunit alpha-7
LigandBDBM50088437
Substrate/Competitorn/a
Meas. Tech.Radioligand Competition Assay
Ki>10000±0 nM
Citation Rohde, LAAhring, PKJensen, MLNielsen, EØPeters, DHelgstrand, CKrintel, CHarpsøe, KGajhede, MKastrup, JSBalle, T Intersubunit bridge formation governs agonist efficacy at nicotinic acetylcholine α4β2 receptors: unique role of halogen bonding revealed. J Biol Chem287:4248-59 (2012) 
 
Neuronal acetylcholine receptor subunit alpha-7
Name:Neuronal acetylcholine receptor subunit alpha-7
Type:Enzyme
Mol. Mass.:56502.44
Organism:Rattus norvegicus (Rat)
Description:Q05941
Residue:502
BDBM50088437
NameBDBM50088437
Synonyms:1-(5-Phenyl-pyridin-3-yl)-[1,4]diazepane NS3570, 3
TypeSmall organic molecule
Emp. Form.C16H19N3
Mol. Mass.253.3422
SMILESC1CNCCN(C1)c1cncc(c1)-c1ccccc1