Reaction Details
TargetNeuronal acetylcholine receptor subunit alpha-7
LigandBDBM50088453
Substrate/Competitorn/a
Meas. Tech.Radioligand Competition Assay
Ki 847±21 nM
Citation Rohde, LAAhring, PKJensen, MLNielsen, EØPeters, DHelgstrand, CKrintel, CHarpsøe, KGajhede, MKastrup, JSBalle, T Intersubunit bridge formation governs agonist efficacy at nicotinic acetylcholine α4β2 receptors: unique role of halogen bonding revealed. J Biol Chem287:4248-59 (2012) 
 
Neuronal acetylcholine receptor subunit alpha-7
Name:Neuronal acetylcholine receptor subunit alpha-7
Type:Enzyme
Mol. Mass.:56502.44
Organism:Rattus norvegicus (Rat)
Description:Q05941
Residue:502
BDBM50088453
NameBDBM50088453
Synonyms:1-(6-Bromo-5-ethoxy-pyridin-3-yl)-[1,4]diazepane CHEMBL72433 | NS3570, 5
TypeSmall organic molecule
Emp. Form.C12H18BrN3O
Mol. Mass.300.195
SMILESCCOc1cc(cnc1Br)N1CCCNCC1