Reaction Details
TargetMatrilysin
LigandBDBM27878
Substrate/Competitorn/a
Meas. Tech.Enzyme Assay
pH6.8±0
Temperature298.15±0 K
IC50>10000±0 nM
Citation Devel, LBeau, FAmoura, MVera, LCassar-Lajeunesse, EGarcia, SCzarny, BStura, EADive, V Simple Pseudo-dipeptides with a P2' Glutamate: A NOVEL INHIBITOR FAMILY OF MATRIX METALLOPROTEASES AND OTHER METZINCINS. J Biol Chem287:26647-56 (2012) 
 
Matrilysin
Name:Matrilysin
Type:Enzyme
Mol. Mass.:29681.54
Organism:Homo sapiens (Human)
Description:P09237
Residue:267
BDBM27878
NameBDBM27878
Synonyms:13-(carbamoylmethyl)-3-oxo-N-[(3-oxo-3,4-dihydro-2H-1,4-benzoxazin-6-yl)methyl]-8-thia-4,6-diazatricyclo[7.4.0.0^{2,7}]trideca-1(9),2(7),5-triene-5-carboxamide hexahydrobenzothienopyrimidine, 2
TypeSmall organic molecule
Emp. Form.C22H21N5O5S
Mol. Mass.467.498
SMILESNC(=O)CC1CCCc2sc3nc([nH]c(=O)c3c12)C(=O)NCc1ccc2OCC(=O)Nc2c1