Reaction Details
TargetCollagenase 3
LigandBDBM92445
Substrate/Competitorn/a
Meas. Tech.Enzyme Assay
pH6.8±0
Temperature298.15±0 K
Ki 603±0.0 nM
Citation Devel, LBeau, FAmoura, MVera, LCassar-Lajeunesse, EGarcia, SCzarny, BStura, EADive, V Simple Pseudo-dipeptides with a P2' Glutamate: A NOVEL INHIBITOR FAMILY OF MATRIX METALLOPROTEASES AND OTHER METZINCINS. J Biol Chem287:26647-56 (2012) 
 
Collagenase 3
Name:Collagenase 3
Type:Enzyme
Mol. Mass.:53808.06
Organism:Homo sapiens (Human)
Description:P45452
Residue:471
BDBM92445
NameBDBM92445
Synonyms:Inhibitor, 10 | US8691753, 105
TypeSmall organic molecule
Emp. Form.C24H24N2O4S
Mol. Mass.436.523
SMILESNC(=O)[C@H](CCC(O)=O)NC(=O)CCc1ccc(cc1)-c1cc(cs1)-c1ccccc1