Reaction Details
TargetNeutrophil collagenase
LigandBDBM92447
Substrate/Competitorn/a
Meas. Tech.Enzyme Assay
pH6.8±0
Temperature298.15±0 K
Ki 5.3±0.0 nM
Citation Devel, LBeau, FAmoura, MVera, LCassar-Lajeunesse, EGarcia, SCzarny, BStura, EADive, V Simple Pseudo-dipeptides with a P2' Glutamate: A NOVEL INHIBITOR FAMILY OF MATRIX METALLOPROTEASES AND OTHER METZINCINS. J Biol Chem287:26647-56 (2012) 
 
Neutrophil collagenase
Name:Neutrophil collagenase
Type:Enzyme
Mol. Mass.:53413.48
Organism:Homo sapiens (Human)
Description:P22894
Residue:467
BDBM92447
NameBDBM92447
Synonyms:Inhibitor, 17
TypeSmall organic molecule
Emp. Form.C19H22N2O4S
Mol. Mass.374.454
SMILESCc1ccc(s1)-c1ccc(CCC(=O)N[C@@H](CCC(O)=O)C(N)=O)cc1