Reaction Details
TargetStromelysin-2
LigandBDBM92447
Substrate/Competitorn/a
Meas. Tech.Enzyme Assay
pH6.8±0
Temperature298.15±0 K
Ki 390±0.0 nM
Citation Devel, LBeau, FAmoura, MVera, LCassar-Lajeunesse, EGarcia, SCzarny, BStura, EADive, V Simple Pseudo-dipeptides with a P2' Glutamate: A NOVEL INHIBITOR FAMILY OF MATRIX METALLOPROTEASES AND OTHER METZINCINS. J Biol Chem287:26647-56 (2012) 
 
Stromelysin-2
Name:Stromelysin-2
Type:Enzyme
Mol. Mass.:54143.02
Organism:Homo sapiens (Human)
Description:P09238
Residue:476
BDBM92447
NameBDBM92447
Synonyms:Inhibitor, 17
TypeSmall organic molecule
Emp. Form.C19H22N2O4S
Mol. Mass.374.454
SMILESCc1ccc(s1)-c1ccc(CCC(=O)N[C@@H](CCC(O)=O)C(N)=O)cc1