Reaction Details
Target4-galactosyl-N-acetylglucosaminide 3-alpha-L-fucosyltransferase FUT6
LigandBDBM50070942
Substrate/Competitorn/a
Meas. Tech.SPA Assay
pH7.3±0
Temperature295.15±0 K
IC50 1800±200 nM
Citation Niu, XFan, XSun, JTing, PNarula, SLundell, D Inhibition of fucosyltransferase VII by gallic acid and its derivatives. Arch Biochem Biophys425:51-7 (2004) 
 
4-galactosyl-N-acetylglucosaminide 3-alpha-L-fucosyltransferase FUT6
Name:4-galactosyl-N-acetylglucosaminide 3-alpha-L-fucosyltransferase FUT6
Type:n/a
Mol. Mass.:41871.43
Organism:Homo sapiens (Human)
Description:P51993
Residue:359
BDBM50070942
NameBDBM50070942
Synonyms:(-)-Epigallocatechin gallate (-)-epigallocatechin 3-gallate CHEMBL297453 Epigallocatechin 3-gallate cid_65064
TypeSmall organic molecule
Emp. Form.C22H18O11
Mol. Mass.458.3717
SMILESOc1cc(O)c2C[C@@H](OC(=O)c3cc(O)c(O)c(O)c3)[C@H](Oc2c1)c1cc(O)c(O)c(O)c1