Reaction Details
TargetCMP-N-acetylneuraminate-beta-galactosamide-alpha-2,3-sialyltransferase 1
LigandBDBM50085536
Substrate/Competitorn/a
Meas. Tech.SPA Assay
pH7.3±0
Temperature295.15±0 K
IC50 19000±2500 nM
Citation Niu, XFan, XSun, JTing, PNarula, SLundell, D Inhibition of fucosyltransferase VII by gallic acid and its derivatives. Arch Biochem Biophys425:51-7 (2004) 
 
CMP-N-acetylneuraminate-beta-galactosamide-alpha-2,3-sialyltransferase 1
Name:CMP-N-acetylneuraminate-beta-galactosamide-alpha-2,3-sialyltransferase 1
Type:n/a
Mol. Mass.:39090.19
Organism:Homo sapiens (Human)
Description:Q11201
Residue:340
BDBM50085536
NameBDBM50085536
Synonyms:3,4,5-Trihydroxybenzoate, X CHEMBL288114 gallic acid
TypeSmall organic molecule
Emp. Form.C7H6O5
Mol. Mass.170.1195
SMILESOC(=O)c1cc(O)c(O)c(O)c1