Reaction Details
TargetCMP-N-acetylneuraminate-beta-galactosamide-alpha-2,3-sialyltransferase 1
LigandBDBM50070942
Substrate/Competitorn/a
Meas. Tech.SPA Assay
pH7.3±0
Temperature295.15±0 K
IC50 27000±500 nM
Citation Niu, XFan, XSun, JTing, PNarula, SLundell, D Inhibition of fucosyltransferase VII by gallic acid and its derivatives. Arch Biochem Biophys425:51-7 (2004) 
 
CMP-N-acetylneuraminate-beta-galactosamide-alpha-2,3-sialyltransferase 1
Name:CMP-N-acetylneuraminate-beta-galactosamide-alpha-2,3-sialyltransferase 1
Type:n/a
Mol. Mass.:39090.19
Organism:Homo sapiens (Human)
Description:Q11201
Residue:340
BDBM50070942
NameBDBM50070942
Synonyms:(-)-Epigallocatechin gallate (-)-epigallocatechin 3-gallate CHEMBL297453 Epigallocatechin 3-gallate cid_65064
TypeSmall organic molecule
Emp. Form.C22H18O11
Mol. Mass.458.3717
SMILESOc1cc(O)c2C[C@@H](OC(=O)c3cc(O)c(O)c(O)c3)[C@H](Oc2c1)c1cc(O)c(O)c(O)c1