Reaction Details
TargetCMP-N-acetylneuraminate-beta-galactosamide-alpha-2,3-sialyltransferase 1
LigandBDBM92459
Substrate/Competitorn/a
Meas. Tech.SPA Assay
pH7.3±0
Temperature295.15±0 K
IC50>200000±0 nM
Citation Niu, XFan, XSun, JTing, PNarula, SLundell, D Inhibition of fucosyltransferase VII by gallic acid and its derivatives. Arch Biochem Biophys425:51-7 (2004) 
 
CMP-N-acetylneuraminate-beta-galactosamide-alpha-2,3-sialyltransferase 1
Name:CMP-N-acetylneuraminate-beta-galactosamide-alpha-2,3-sialyltransferase 1
Type:n/a
Mol. Mass.:39090.19
Organism:Homo sapiens (Human)
Description:Q11201
Residue:340
BDBM92459
NameBDBM92459
Synonyms:CHEMBL384759 Guanosine Diphosphate
TypeSmall molecule
Emp. Form.C10H15N5O11P2
Mol. Mass.443.2005
SMILESNc1nc2n(cnc2c(=O)[nH]1)[C@@H]1O[C@H](COP(O)(=O)OP(O)(O)=O)[C@@H](O)[C@H]1O