Reaction Details
TargetMatrilysin
LigandBDBM92459
Substrate/Competitorn/a
Meas. Tech.SPA Assay
pH7.5±0
Temperature295.15±0 K
IC50>200000±0 nM
Citation Niu, XFan, XSun, JTing, PNarula, SLundell, D Inhibition of fucosyltransferase VII by gallic acid and its derivatives. Arch Biochem Biophys425:51-7 (2004) 
 
Matrilysin
Name:Matrilysin
Type:Enzyme
Mol. Mass.:29681.54
Organism:Homo sapiens (Human)
Description:P09237
Residue:267
BDBM92459
NameBDBM92459
Synonyms:CHEMBL384759 Guanosine Diphosphate
TypeSmall molecule
Emp. Form.C10H15N5O11P2
Mol. Mass.443.2005
SMILESNc1nc2n(cnc2c(=O)[nH]1)[C@@H]1O[C@H](COP(O)(=O)OP(O)(O)=O)[C@@H](O)[C@H]1O