Reaction Details
TargetMacrophage metalloelastase
LigandBDBM92443
Substrate/Competitorn/a
Meas. Tech.Enzyme Assay
pH6.8±0
Temperature298.15±0 K
Ki 1.92±0.0 nM
Citation Devel, LGarcia, SCzarny, BBeau, FLaJeunesse, EVera, LGeorgiadis, DStura, EDive, V Insights from selective non-phosphinic inhibitors of MMP-12 tailored to fit with an S1' loop canonical conformation. J Biol Chem285:35900-9 (2010) 
 
Macrophage metalloelastase
Name:Macrophage metalloelastase
Type:Enzyme
Mol. Mass.:54012.99
Organism:Homo sapiens (Human)
Description:P39900
Residue:470
BDBM92443
NameBDBM92443
Synonyms:MMP Inhibitor, 3 US8691753, 97
TypeSmall molecule
Emp. Form.C29H31N3O7S
Mol. Mass.565.637
SMILESNC(=O)[C@@H](CCC(O)=O)NC(=O)[C@H](CCC(O)=O)NC(=O)CCc1ccc(cc1)-c1cc(cs1)-c1ccccc1