Reaction Details
TargetStromelysin-2
LigandBDBM92441
Substrate/Competitorn/a
Meas. Tech.Enzyme Assay
pH6.8±0
Temperature298.15±0 K
Ki 8.3±0.0 nM
Citation Devel, LGarcia, SCzarny, BBeau, FLaJeunesse, EVera, LGeorgiadis, DStura, EDive, V Insights from selective non-phosphinic inhibitors of MMP-12 tailored to fit with an S1' loop canonical conformation. J Biol Chem285:35900-9 (2010) 
 
Stromelysin-2
Name:Stromelysin-2
Type:Enzyme
Mol. Mass.:54143.02
Organism:Homo sapiens (Human)
Description:P09238
Residue:476
BDBM92441
NameBDBM92441
Synonyms:RXP470, 1 | RXP470, Compound 4
TypePeptide
Emp. Form.C35H35BrClN4O10P
Mol. Mass.818.004
SMILESNC(=O)[C@@H](CCC(O)=O)NC(=O)[C@H](CCC(O)=O)NC(=O)C(Cc1cc(no1)-c1ccc(cc1)-c1cccc(Cl)c1)CP(O)(=O)c1ccc(Br)cc1