Reaction Details
TargetMacrophage migration inhibitory factor
LigandBDBM92518
Substrate/CompetitorBDBM92519
Meas. Tech.Tautomerase Enzyme Assay
pH6.5±0
Ki 4.5e+2±n/a nM
IC50 3.02e+3±n/a nM
Citation Ouertatani-Sakouhi, HEl-Turk, FFauvet, BCho, MKPinar Karpinar, DLe Roy, DDewor, MRoger, TBernhagen, JCalandra, TZweckstetter, MLashuel, HA Identification and characterization of novel classes of macrophage migration inhibitory factor (MIF) inhibitors with distinct mechanisms of action. J Biol Chem285:26581-98 (2010) 
 
Macrophage migration inhibitory factor
Name:Macrophage migration inhibitory factor
Type:Enzyme
Mol. Mass.:12478.18
Organism:Homo sapiens (Human)
Description:P14174
Residue:115
BDBM92518
BDBM92519
NameBDBM92518
Synonyms:RJC 04082, 14
TypeSmall organic molecule
Emp. Form.C19H15NO3
Mol. Mass.305.3273
SMILESO=C(Oc1cc(=O)n2CCCc3cccc1c23)c1ccccc1