Reaction Details
TargetAcetylcholinesterase
LigandBDBM92544
Substrate/Competitorn/a
Meas. Tech.Inhibition Assay
Ki 1.25e+3± 6e+1 nM
Citation Raza, RSaeed, AArif, MMahmood, SMuddassar, MRaza, AIqbal, J Synthesis and Biological Evaluation of 3-thiazolocoumarinyl Schiff-base Derivatives as Cholinesterase Inhibitors. Chem Biol Drug Des80:605-15 (2012) 
 
Acetylcholinesterase
Name:Acetylcholinesterase
Type:Enzyme
Mol. Mass.:67792.70
Organism:Homo sapiens (Human)
Description:P22303
Residue:614
BDBM92544
NameBDBM92544
Synonyms:Coumarin analogue, 3b
TypeSmall molecule
Emp. Form.C20H15N3O3S
Mol. Mass.377.416
SMILESCOc1ccc(CN=Nc2nc(cs2)-c2cc3ccccc3oc2=O)cc1