Reaction Details
TargetCholinesterase
LigandBDBM92544
Substrate/Competitorn/a
Meas. Tech.Inhibition Assay
Ki 64± 2 nM
Citation Raza, RSaeed, AArif, MMahmood, SMuddassar, MRaza, AIqbal, J Synthesis and Biological Evaluation of 3-thiazolocoumarinyl Schiff-base Derivatives as Cholinesterase Inhibitors. Chem Biol Drug Des80:605-15 (2012) 
 
Cholinesterase
Name:Cholinesterase
Type:Homotetramer
Mol. Mass.:68422.27
Organism:Homo sapiens (Human)
Description:P06276
Residue:602
BDBM92544
NameBDBM92544
Synonyms:Coumarin analogue, 3b
TypeSmall molecule
Emp. Form.C20H15N3O3S
Mol. Mass.377.416
SMILESCOc1ccc(CN=Nc2nc(cs2)-c2cc3ccccc3oc2=O)cc1