Reaction Details
TargetGlutamine-dependent NAD(+) synthetase
LigandBDBM92600
Substrate/Competitorn/a
Meas. Tech.Inhibition Assay
pH8.5±0
Temperature310.15±0 K
IC50 5.78e+4± 2.2e+3 nM
Citation Boshoff, HIXu, XTahlan, KDowd, CSPethe, KCamacho, LRPark, THYun, CSSchnappinger, DEhrt, SWilliams, KJBarry, CE Biosynthesis and recycling of nicotinamide cofactors in mycobacterium tuberculosis. An essential role for NAD in nonreplicating bacilli. J Biol Chem283:19329-41 (2008) 
 
Glutamine-dependent NAD(+) synthetase
Name:Glutamine-dependent NAD(+) synthetase
Type:Enzyme
Mol. Mass.:79282.89
Organism:Homo sapiens (Human)
Description:Q6IA69
Residue:706
BDBM92600
NameBDBM92600
Synonyms:CHEMBL419944 | NAD Synthetase Inhibitor, 5
TypeOrganic molecule
Emp. Form.C30H41N2O4
Mol. Mass.493.657
SMILESCOC(=O)c1cc2ccccc2n1CCCCCCCCCOC(=O)Cc1ccc(cc1)[N+](C)(C)C