Reaction Details
TargetCalcium/calmodulin-dependent protein kinase type II subunit beta
LigandBDBM92607
Substrate/Competitorn/a
Meas. Tech.Enzyme Assay
Temperature303.15±0 K
Ki 7.13e+4± 1.19e+4 nM
Citation Chijiwa, TMishima, AHagiwara, MSano, MHayashi, KInoue, TNaito, KToshioka, THidaka, H Inhibition of forskolin-induced neurite outgrowth and protein phosphorylation by a newly synthesized selective inhibitor of cyclic AMP-dependent protein kinase, N-[2-(p-bromocinnamylamino)ethyl]-5-isoquinolinesulfonamide (H-89), of PC12D pheochromocytoma cells. J Biol Chem265:5267-72 (1990) Calcium/calmodulin-dependent protein kinase type II subunit beta
Name:Calcium/calmodulin-dependent protein kinase type II subunit beta
Type:Enzyme Catalytic Domain
Mol. Mass.:72685.48
Organism:Homo sapiens (Human)
Description:gi_26051204
Residue:666
BDBM92607
NameBDBM92607
Synonyms:H-88
TypeSmall Molecule
Emp. Form.C20H21N3O2S
Mol. Mass.367.465
SMILESO=S(=O)(NCCNC\C=C\c1ccccc1)c1cccc2cnccc12