Reaction Details
Target1,25-dihydroxyvitamin D(3) 24-hydroxylase, mitochondrial
LigandBDBM92776
Substrate/Competitorn/a
Meas. Tech.CYP24A1Inhibition Assay
Ki 90± 10 nM
Citation Zhu, JBarycki, RChiellini, GDeluca, HF Screening of selective inhibitors of 1a,25-dihydroxyvitamin D3 24-hydroxylase using recombinant human enzyme expressed in Escherichia coli. Biochemistry49:10403-11 (2010) 
 
1,25-dihydroxyvitamin D(3) 24-hydroxylase, mitochondrial
Name:1,25-dihydroxyvitamin D(3) 24-hydroxylase, mitochondrial
Type:Protein
Mol. Mass.:58889.66
Organism:Homo sapiens (Human)
Description:Q07973
Residue:514
BDBM92776
NameBDBM92776
Synonyms:24COOH-25(OH)D3
TypeSmall molecule
Emp. Form.C24H36O3
Mol. Mass.372.5408
SMILESC[C@@H](CCC(O)=O)C1CCC2\C(CCC[C@]12C)=C\C=C1\C[C@H](O)CCC1=C