Reaction Details
Target1,25-dihydroxyvitamin D(3) 24-hydroxylase, mitochondrial
LigandBDBM92778
Substrate/Competitorn/a
Meas. Tech.CYP24A1Inhibition Assay
Ki 21± 7 nM
Citation Zhu, JBarycki, RChiellini, GDeluca, HF Screening of selective inhibitors of 1a,25-dihydroxyvitamin D3 24-hydroxylase using recombinant human enzyme expressed in Escherichia coli. Biochemistry49:10403-11 (2010) 
 
1,25-dihydroxyvitamin D(3) 24-hydroxylase, mitochondrial
Name:1,25-dihydroxyvitamin D(3) 24-hydroxylase, mitochondrial
Type:Protein
Mol. Mass.:58889.66
Organism:Homo sapiens (Human)
Description:Q07973
Residue:514
BDBM92778
NameBDBM92778
Synonyms:AB47
TypeSmall molecule
Emp. Form.C24H35BrO3
Mol. Mass.451.437
SMILESC[C@@H](COC(=O)CBr)C1CCC2\C(CCC[C@]12C)=C\C=C1\C[C@H](O)CCC1=C