Reaction Details
Target25-hydroxyvitamin D-1 alpha hydroxylase, mitochondrial
LigandBDBM8610
Substrate/Competitorn/a
Meas. Tech.CYP27B1 Inhibition Assay
Ki 53± 10 nM
Citation Zhu, JBarycki, RChiellini, GDeluca, HF Screening of selective inhibitors of 1a,25-dihydroxyvitamin D3 24-hydroxylase using recombinant human enzyme expressed in Escherichia coli. Biochemistry49:10403-11 (2010) 
 
25-hydroxyvitamin D-1 alpha hydroxylase, mitochondrial
Name:25-hydroxyvitamin D-1 alpha hydroxylase, mitochondrial
Type:Protein
Mol. Mass.:56522.50
Organism:Homo sapiens (Human)
Description:O15528
Residue:508
BDBM8610
NameBDBM8610
Synonyms:1-[4-(4-{[(2R,4S)-2-(2,4-dichlorophenyl)-2-(1H-imidazol-1-ylmethyl)-1,3-dioxolan-4-yl]methoxy}phenyl)piperazin-1-yl]ethan-1-one CHEMBL75 Ketoconazole US9138393, Ketoconozole | US9144538, Ketoconozole
TypeSmall organic molecule
Emp. Form.C26H28Cl2N4O4
Mol. Mass.531.431
SMILES[H][C@]1(COc2ccc(cc2)N2CCN(CC2)C(C)=O)CO[C@@](Cn2ccnc2)(O1)c1ccc(Cl)cc1Cl