Reaction Details
TargetCarbon monoxide dehydrogenase small chain
LigandBDBM22774
Substrate/Competitorn/a
Meas. Tech.Inhibition Assay
Kd 4.76e+4±n/a nM
Citation Wilcoxen, JZhang, BHille, R Reaction of the molybdenum- and copper-containing carbon monoxide dehydrogenase from Oligotropha carboxydovorans with quinones. Biochemistry50:1910-6 (2011) 
 
Carbon monoxide dehydrogenase small chain
Name:Carbon monoxide dehydrogenase small chain
Type:Enzyme
Mol. Mass.:17790.76
Organism:Oligotropha carboxidovorans
Description:P19921
Residue:166
BDBM22774
NameBDBM22774
Synonyms:1,4-Benzoquinone CHEMBL8320 cid_4650 | cyclohexa-2,5-diene-1,4-dione
TypeSmall organic molecule
Emp. Form.C6H4O2
Mol. Mass.108.0948
SMILESO=C1C=CC(=O)C=C1