Reaction Details
TargetAurora kinase A
LigandBDBM87048
Substrate/Competitorn/a
Meas. Tech.In Vitro Enzyme Assay
IC50 6.1±1.0 nM
Citation Lawrence, HRMartin, MPLuo, YPireddu, RYang, HGevariya, HOzcan, SZhu, JYKendig, RRodriguez, MElias, RCheng, JQSebti, SMSchonbrunn, ELawrence, NJ Development of o-chlorophenyl substituted pyrimidines as exceptionally potent aurora kinase inhibitors. J Med Chem55:7392-416 (2012) 
 
Aurora kinase A
Name:Aurora kinase A
Type:Serine/threonine-protein kinase
Mol. Mass.:45830.98
Organism:Homo sapiens (Human)
Description:O14965
Residue:403
BDBM87048
NameBDBM87048
Synonyms:Bisanilinopyrimidine inhibitor, 2 US9249124, 1
TypeSmall organic molecule
Emp. Form.C18H14N4O4
Mol. Mass.350.3282
SMILESOC(=O)c1ccc(Nc2nccc(Nc3ccccc3C(O)=O)n2)cc1